BDBM50373902 CHEMBL405228
SMILES COc1ccccc1N1CCN(CCCNc2ccc3ccccc3n2)CC1
InChI Key InChIKey=QOBDMGBFOCZPDY-UHFFFAOYSA-N
Data  1 KI
  Tab Delimited (TSV)   2D SDfile   Computed 3D by Vconf -m prep SDfile
Find this compound or compounds like it in BindingDB:
Activity Spreadsheet -- Enzyme Inhibition Constant Data from BindingDB
Found 1 hit for monomerid = 50373902
Target5-hydroxytryptamine receptor 1A(Homo sapiens (Human))
Universita Degli Studi Di Bari
Curated by ChEMBL
LigandPNGBDBM50373902(CHEMBL405228)
Affinity DataKi:  13nM. Assay description: Displacement of [3H]8-OH-DPAT from human 5HT1A receptor expressed in HEK293 cells after 120 mins
In DepthDetails ArticlePubMed