BDBM50374347 CHEMBL270680
SMILES CC(C)[C@H](NC(=O)c1ccc(cc1)C(=O)NS(=O)(=O)c1ccc(Cl)cc1)C(=O)N1CCC[C@H]1C(=O)N[C@@H](C(C)C)C(=O)c1nc2ccc(cc2o1)C(N)=O
InChI Key InChIKey=WCDVUVRREYDJLF-BKHJTQGXSA-N
Data  1 KI
  Tab Delimited (TSV)   2D SDfile   Computed 3D by Vconf -m prep SDfile
Find this compound or compounds like it in BindingDB:
Activity Spreadsheet -- Enzyme Inhibition Constant Data from BindingDB
Found 1 hit for monomerid = 50374347
TargetNeutrophil elastase(Homo sapiens (Human))
Johnson & Johnson Pharmaceutical Research & Development
Curated by ChEMBL
LigandPNGBDBM50374347(CHEMBL270680)
Affinity DataKi:  0.200nM. Assay description: Inhibition of human neutrophil elastase
In DepthDetails ArticlePubMed