BDBM50374682 CHEMBL403154
SMILES CC(C)(C)CN1CCC(CC1)NC(=O)c1csc(NC(=O)c2ccc3cc4C(=O)NCC(C)(C)n4c3c2)n1
InChI Key InChIKey=WWRZEFXYASLXQU-UHFFFAOYSA-N
Data  1 IC50
  Tab Delimited (TSV)   2D SDfile   Computed 3D by Vconf -m prep SDfile
Find this compound or compounds like it in BindingDB:
Activity Spreadsheet -- Enzyme Inhibition Constant Data from BindingDB
Found 1 hit for monomerid = 50374682
TargetMAP kinase-activated protein kinase 2(Homo sapiens (Human))
Boehringer Ingelheim Pharmaceuticals
Curated by ChEMBL
LigandPNGBDBM50374682(CHEMBL403154)
Affinity DataIC50:  2nM. Assay description: Inhibition of MK2
In DepthDetails ArticlePubMed