BDBM50375138 CHEMBL402852
SMILES NC(=O)c1cn(-c2ccc3CCCc3c2)c2nc(Nc3cccc(c3)C(=O)N3CCCCC3)ncc2c1=O
InChI Key InChIKey=HNEMHQQLAZYDHS-UHFFFAOYSA-N
Data  1 IC50
  Tab Delimited (TSV)   2D SDfile   Computed 3D by Vconf -m prep SDfile
Find this compound or compounds like it in BindingDB:
Activity Spreadsheet -- Enzyme Inhibition Constant Data from BindingDB
Found 1 hit for monomerid = 50375138
TargetMacrophage colony-stimulating factor 1 receptor(Homo sapiens (Human))
Johnson & Johnson Pharmaceutical Research & Development
Curated by ChEMBL
LigandPNGBDBM50375138(CHEMBL402852)
Affinity DataIC50:  4nM. Assay description: Inhibition of ATP-induced CSF1R autophosphorylation
In DepthDetails ArticlePubMed