BDBM50376160 CHEMBL440410
SMILES Oc1ccc(\C=C\C(=O)\C=C\c2cc(Br)c(O)c(Br)c2)cc1Br
InChI Key InChIKey=CJBWVEUCVWPBRZ-GRSRPBPQSA-N
Data  1 IC50
  Tab Delimited (TSV)   2D SDfile   Computed 3D by Vconf -m prep SDfile
Find this compound or compounds like it in BindingDB:
Activity Spreadsheet -- Enzyme Inhibition Constant Data from BindingDB
Found 1 hit for monomerid = 50376160
TargetRmtA(Emericella nidulans)
Sapienza University Of Rome
Curated by ChEMBL
LigandPNGBDBM50376160(CHEMBL440410)
Affinity DataIC50:  4.00E+4nM. Assay description: Inhibition of Aspergillus nidulans RmtA
In DepthDetails ArticlePubMed