BDBM50377057 CHEMBL256950
SMILES O=C(Nc1ccc(cc1C1=CCCC1)C1CCNCC1)c1ncc([nH]1)C#N
InChI Key InChIKey=FXFXHNQBLWHYDI-UHFFFAOYSA-N
Data  1 IC50
  Tab Delimited (TSV)   2D SDfile   Computed 3D by Vconf -m prep SDfile
Find this compound or compounds like it in BindingDB:
Activity Spreadsheet -- Enzyme Inhibition Constant Data from BindingDB
Found 1 hit for monomerid = 50377057
TargetMacrophage colony-stimulating factor 1 receptor(Homo sapiens (Human))
Johnson & Johnson Pharmaceutical Research & Development
Curated by ChEMBL
LigandPNGBDBM50377057(CHEMBL256950)
Affinity DataIC50:  8nM. Assay description: Inhibition of FMS
In DepthDetails ArticlePubMed