BDBM50377071 CHEMBL402337
SMILES CC1CCC(=CC1)c1cc(ccc1NC(=O)c1ncc([nH]1)C#N)C1CCNCC1
InChI Key InChIKey=NRRNXHWXRHOSFE-UHFFFAOYSA-N
Data  1 IC50
  Tab Delimited (TSV)   2D SDfile   Computed 3D by Vconf -m prep SDfile
Find this compound or compounds like it in BindingDB:
Activity Spreadsheet -- Enzyme Inhibition Constant Data from BindingDB
Found 1 hit for monomerid = 50377071
TargetMacrophage colony-stimulating factor 1 receptor(Homo sapiens (Human))
Johnson & Johnson Pharmaceutical Research & Development
Curated by ChEMBL
LigandPNGBDBM50377071(CHEMBL402337)
Affinity DataIC50:  0.400nM. Assay description: Inhibition of FMS
In DepthDetails ArticlePubMed