BDBM50377332 CHEMBL436648
SMILES CC1(C)CC(CC(C)(C)N1[O])NC(=S)Nc1ccc(cc1Cl)S(N)(=O)=O
InChI Key InChIKey=OGPGDXJNUSGCSG-UHFFFAOYSA-N
Data  3 KI
  Tab Delimited (TSV)   2D SDfile   Computed 3D by Vconf -m prep SDfile
Find this compound or compounds like it in BindingDB:
Activity Spreadsheet -- Enzyme Inhibition Constant Data from BindingDB
Found 3 hits for monomerid = 50377332
TargetCarbonic anhydrase 2(Homo sapiens (Human))
Universit£
Curated by ChEMBL
LigandPNGBDBM50377332(CHEMBL436648)
Affinity DataKi:  12nM. Assay description: Inhibition of human recombinant carbonic anhydrase 2 by CO2 hydration stopped-flow assay
In DepthDetails ArticlePubMed
TargetCarbonic anhydrase 9(Homo sapiens (Human))
Universit£
Curated by ChEMBL
LigandPNGBDBM50377332(CHEMBL436648)
Affinity DataKi:  14nM. Assay description: Inhibition of human cloned carbonic anhydrase 9 by CO2 hydration stopped-flow assay
In DepthDetails ArticlePubMed
TargetCarbonic anhydrase 1(Homo sapiens (Human))
Universit£
Curated by ChEMBL
LigandPNGBDBM50377332(CHEMBL436648)
Affinity DataKi:  128nM. Assay description: Inhibition of human recombinant carbonic anhydrase 1 by CO2 hydration stopped-flow assay
In DepthDetails ArticlePubMed