BDBM50377388 CHEMBL406316
SMILES C1Cc2c(cccc2-c2cn[nH]c2)C1c1ncc[nH]1
InChI Key InChIKey=ZXQIPWRUBBPGML-UHFFFAOYSA-N
Data  4 EC50
  Tab Delimited (TSV)   2D SDfile   Computed 3D by Vconf -m prep SDfile
Find this compound or compounds like it in BindingDB:
Activity Spreadsheet -- Enzyme Inhibition Constant Data from BindingDB
Found 4 hits for monomerid = 50377388
TargetAlpha-2A adrenergic receptor(Homo sapiens (Human))
Pfizer
Curated by ChEMBL
LigandPNGBDBM50377388(CHEMBL406316)
Affinity DataEC50: >1.00E+4nM. Assay description: Agonist activity at human cloned adrenergic alpha-2A receptor expressed in CHOK1 cells by beta-lactamase reporter gene assay
In DepthDetails ArticlePubMed
TargetAlpha-1D adrenergic receptor(Homo sapiens (Human))
Pfizer
Curated by ChEMBL
LigandPNGBDBM50377388(CHEMBL406316)
Affinity DataEC50:  319nM. Assay description: Agonist activity at human cloned adrenergic Alpha-1D receptor expressed in CHO cells assessed as calcium mobilization by FLIPR
In DepthDetails ArticlePubMed
TargetAlpha-1B adrenergic receptor(Homo sapiens (Human))
Pfizer
Curated by ChEMBL
LigandPNGBDBM50377388(CHEMBL406316)
Affinity DataEC50: >1.00E+4nM. Assay description: Agonist activity at human cloned adrenergic alpha-1B receptor expressed in CHO cells assessed as calcium mobilization by FLIPR
In DepthDetails ArticlePubMed
TargetAlpha-1A adrenergic receptor(Homo sapiens (Human))
Pfizer
Curated by ChEMBL
LigandPNGBDBM50377388(CHEMBL406316)
Affinity DataEC50:  14nM. Assay description: Agonist activity at human cloned adrenergic alpha-1A receptor expressed in CHO cells assessed as calcium mobilization by FLIPR
In DepthDetails ArticlePubMed