BDBM50377612 CHEMBL255916
SMILES Nc1ccc(CNC(=O)Cc2c(F)c(NCC(F)(F)c3ccccn3)ccc2C#N)cn1
InChI Key InChIKey=UOKDWGUITBJLLA-UHFFFAOYSA-N
Data  1 KI
  Tab Delimited (TSV)   2D SDfile   Computed 3D by Vconf -m prep SDfile
Find this compound or compounds like it in BindingDB:
Activity Spreadsheet -- Enzyme Inhibition Constant Data from BindingDB
Found 1 hit for monomerid = 50377612
TargetProthrombin(Homo sapiens (Human))
Johnson & Johnson Pharmaceutical Research & Development
Curated by ChEMBL
LigandPNGBDBM50377612(CHEMBL255916)
Affinity DataKi:  11nM. Assay description: Binding affinity to human thrombin
In DepthDetails ArticlePubMed