BDBM50377631 CHEMBL256152
SMILES Clc1ccc(NC(=O)c2cc(Br)ccc2NC(=O)c2ccc(cc2)N2CCCCC2=O)nc1
InChI Key InChIKey=DWZGVJWDCQIORX-UHFFFAOYSA-N
Data  1 KI
  Tab Delimited (TSV)   2D SDfile   Computed 3D by Vconf -m prep SDfile
Find this compound or compounds like it in BindingDB:
Activity Spreadsheet -- Enzyme Inhibition Constant Data from BindingDB
Found 1 hit for monomerid = 50377631
TargetCoagulation factor X(Homo sapiens (Human))
Bristol-Myers Squibb Research And Development
Curated by ChEMBL
LigandPNGBDBM50377631(CHEMBL256152)
Affinity DataKi:  0.140nM. Assay description: Inhibition of human factor 10a
In DepthDetails ArticlePubMed