BDBM50377635 CHEMBL402980
SMILES COc1cc(Cl)cc(C(=O)Nc2ccc(Cl)cn2)c1NC(=O)c1ccc(cc1)-n1ccccc1=O
InChI Key InChIKey=KIUAYZXZFQAAHD-UHFFFAOYSA-N
Data  1 KI
  Tab Delimited (TSV)   2D SDfile   Computed 3D by Vconf -m prep SDfile
Find this compound or compounds like it in BindingDB:
Activity Spreadsheet -- Enzyme Inhibition Constant Data from BindingDB
Found 1 hit for monomerid = 50377635
TargetCoagulation factor X(Homo sapiens (Human))
Bristol-Myers Squibb Research And Development
Curated by ChEMBL
LigandPNGBDBM50377635(CHEMBL402980)
Affinity DataKi:  0.0130nM. Assay description: Inhibition of human factor 10a
In DepthDetails ArticlePubMed