BDBM50377636 CHEMBL257399
SMILES COc1cccc(C(=O)Nc2ccc(Cl)cn2)c1NC(=O)c1ccc(cc1)-n1ccccc1=O
InChI Key InChIKey=ANNVTCVMYVAAKL-UHFFFAOYSA-N
Data  1 KI
  Tab Delimited (TSV)   2D SDfile   Computed 3D by Vconf -m prep SDfile
Find this compound or compounds like it in BindingDB:
Activity Spreadsheet -- Enzyme Inhibition Constant Data from BindingDB
Found 1 hit for monomerid = 50377636
TargetCoagulation factor X(Homo sapiens (Human))
Bristol-Myers Squibb Research And Development
Curated by ChEMBL
LigandPNGBDBM50377636(CHEMBL257399)
Affinity DataKi:  0.140nM. Assay description: Inhibition of human factor 10a
In DepthDetails ArticlePubMed