BDBM50378527 CHEMBL569010
SMILES CCOC(=O)c1ncn-2c1Cn1ncnc1-c1cc(ccc-21)C#C
InChI Key InChIKey=SPUDBCPXWITYDE-UHFFFAOYSA-N
Data  1 KI
  Tab Delimited (TSV)   2D SDfile   Computed 3D by Vconf -m prep SDfile
Find this compound or compounds like it in BindingDB:
Activity Spreadsheet -- Enzyme Inhibition Constant Data from BindingDB
Found 1 hit for monomerid = 50378527
TargetGABA-A receptor; alpha-5/beta-3/gamma-2(Homo sapiens (Human))
F. Hoffmann-La Roche
Curated by ChEMBL
LigandPNGBDBM50378527(CHEMBL569010)
Affinity DataKi:  0.600nM. Assay description: Binding affinity to GABAA alpha-5-beta-3-gamma-2 receptor
In DepthDetails ArticlePubMed