BDBM50378560 CHEMBL566065
SMILES Nc1nc2NCC(CCNc3ccc(cc3)C(O)=O)=Nc2c(=O)[nH]1
InChI Key InChIKey=KCMJLKPNBXLNNJ-UHFFFAOYSA-N
Data  1 IC50
PDB links: 1 PDB ID matches this monomer.
  Tab Delimited (TSV)   2D SDfile   Computed 3D by Vconf -m prep SDfile
Find this compound or compounds like it in BindingDB:
Activity Spreadsheet -- Enzyme Inhibition Constant Data from BindingDB
Found 1 hit for monomerid = 50378560
TargetDihydropteroate synthase(Bacillus anthracis)
University Of Tennessee Health Science Center
Curated by ChEMBL
LigandPNGBDBM50378560(CHEMBL566065)
Affinity DataIC50:  2.59E+4nM. Assay description: Inhibition of Bacillus anthracis DHPS expressed in Escherichia coli BL21 (DE3) after 30 mins