BDBM50378795 CHEMBL1215473
SMILES Nc1nnc([nH]1)N1CCN(CCOc2ccc(Br)cc2)CC1
InChI Key InChIKey=GGFPYJPCWQIIKE-UHFFFAOYSA-N
Data  5 IC50  1 Kd
PDB links: 1 PDB ID matches this monomer.
  Tab Delimited (TSV)   2D SDfile   Computed 3D by Vconf -m prep SDfile
Find this compound or compounds like it in BindingDB:
Activity Spreadsheet -- Enzyme Inhibition Constant Data from BindingDB
Found 6 hits for monomerid = 50378795
TargetAcidic mammalian chitinase(Homo sapiens (Human))
Pfizer
Curated by ChEMBL
LigandPNGBDBM50378795(CHEMBL1215473)
Affinity DataIC50:  210nM. Assay description: Inhibition of acidic mammalian chitinase after 60 mins
TargetAcidic mammalian chitinase(Homo sapiens (Human))
Pfizer
Curated by ChEMBL
LigandPNGBDBM50378795(CHEMBL1215473)
Affinity DataKd:  1.69E+3nM. Assay description: Binding affinity to biotinylated-acidic mammalian chitinase
TargetChitotriosidase-1(Homo sapiens (Human))
Oncoarendi Therapeutics
Curated by ChEMBL
LigandPNGBDBM50378795(CHEMBL1215473)
Affinity DataIC50:  6.76E+3nM. Assay description: Inhibition of human recombinant full length C-terminal His-tagged chitotriosidase expressed in CHO-K1 cells using 4-methylumbelliferyl-beta-D-N,N',N\...
In DepthDetails ArticlePubMed
TargetAcidic mammalian chitinase(Homo sapiens (Human))
Pfizer
Curated by ChEMBL
LigandPNGBDBM50378795(CHEMBL1215473)
Affinity DataIC50:  5.45E+3nM. Assay description: Inhibition of human recombinant full length C-terminal His-tagged acidic mammalian chitinase expressed in CHO-K1 cells using 4-methylumbelliferyl-bet...
TargetAcidic mammalian chitinase(Mus musculus)
Oncoarendi Therapeutics
Curated by ChEMBL
LigandPNGBDBM50378795(CHEMBL1215473)
Affinity DataIC50:  2.10E+3nM. Assay description: Inhibition of mouse recombinant full length C-terminal His-tagged acidic mammalian chitinase expressed in CHO-K1 cells using 4-methylumbelliferyl-bet...
In DepthDetails ArticlePubMed
TargetChitotriosidase-1(Mus musculus)
Oncoarendi Therapeutics
Curated by ChEMBL
LigandPNGBDBM50378795(CHEMBL1215473)
Affinity DataIC50:  1.98E+4nM. Assay description: Inhibition of mouse recombinant full length C-terminal His-tagged chitotriosidase expressed in CHO-K1 cells using 4-methylumbelliferyl-beta-D-N,N',N\...
In DepthDetails ArticlePubMed