BDBM50379106 CHEMBL2012684
SMILES O[C@@H]1[C@@H]2C[C@@H]2[C@H]([C@@H]1O)n1cnc2c(NCC3CC3)nc(Cl)nc12
InChI Key InChIKey=NFODXFUERKMFSF-FFVUVFKMSA-N
Data  7 KI
  Tab Delimited (TSV)   2D SDfile   Computed 3D by Vconf -m prep SDfile
Find this compound or compounds like it in BindingDB:
Activity Spreadsheet -- Enzyme Inhibition Constant Data from BindingDB
Found 7 hits for monomerid = 50379106
TargetAdenosine receptor A1(Rattus norvegicus (rat))
TBA
Curated by ChEMBL
LigandPNGBDBM50379106(CHEMBL2012684)
Affinity DataKi:  0.800nM. Assay description: Displacement of [3H]R-PIA from rat forebrain adenosine receptor-1
In DepthDetails ArticlePubMed
TargetAdenosine receptor A3(Homo sapiens (Human))
National Institute Of Diabetes And Digestive And Kidney Diseases
Curated by ChEMBL
LigandPNGBDBM50379106(CHEMBL2012684)
Affinity DataKi:  8.90nM. Assay description: Displacement of [125I]I-AB-MECA from human A3 adenosine receptor expressed in CHO cells after 60 min Packard Cobra 2 gamma-counter
In DepthDetails ArticlePubMed
TargetAdenosine receptor A3(Homo sapiens (Human))
National Institute Of Diabetes And Digestive And Kidney Diseases
Curated by ChEMBL
LigandPNGBDBM50379106(CHEMBL2012684)
Affinity DataKi:  8.90nM. Assay description: Displacement of [125I]AB-MECA from human recombinant adenosine receptor-3 expressed in CHO cell membrane after 60 mins by gamma-counting
In DepthDetails ArticlePubMed
TargetAdenosine receptor A1(Homo sapiens (Human))
National Institute Of Diabetes And Digestive And Kidney Diseases
Curated by ChEMBL
LigandPNGBDBM50379106(CHEMBL2012684)
Affinity DataKi:  68.4nM. Assay description: Displacement of [3H]R-PIA from human A1 adenosine receptor expressed in CHO cells after 60 min by Perkin Elmer Liquid Scintillation Analyzer
In DepthDetails ArticlePubMed
TargetAdenosine receptor A1(Homo sapiens (Human))
National Institute Of Diabetes And Digestive And Kidney Diseases
Curated by ChEMBL
LigandPNGBDBM50379106(CHEMBL2012684)
Affinity DataKi:  68.4nM. Assay description: Displacement of [3H]R-PIA from human recombinant adenosine receptor-1 expressed in CHO cell membrane after 60 mins by liquid scintillation counting
In DepthDetails ArticlePubMed
TargetAdenosine receptor A2a(Homo sapiens (Human))
TBA
Curated by ChEMBL
LigandPNGBDBM50379106(CHEMBL2012684)
Affinity DataKi:  4.41E+3nM. Assay description: Displacement of [3H]CGS21680 from human recombinant adenosine receptor-2A expressed in HEK293 cell membrane after 60 mins by liquid scintillation cou...
In DepthDetails ArticlePubMed
TargetAdenosine receptor A2a(Homo sapiens (Human))
TBA
Curated by ChEMBL
LigandPNGBDBM50379106(CHEMBL2012684)
Affinity DataKi:  4.41E+3nM. Assay description: Displacement of [3H]CGS21680 from human A2a adenosine receptor expressed in HEK293 cells after 60 min by Perkin Elmer Liquid Scintillation Analyzer
In DepthDetails ArticlePubMed