BDBM50379112 CHEMBL2012693
SMILES COc1cc(F)c(F)cc1CNc1nc(Cl)nc2n(cnc12)[C@@H]1[C@H]2C[C@H]2[C@@H](O)[C@H]1O
InChI Key InChIKey=RWYGLZYBRQKSMG-HDUOCVEJSA-N
Data  3 KI
  Tab Delimited (TSV)   2D SDfile   Computed 3D by Vconf -m prep SDfile
Find this compound or compounds like it in BindingDB:
Activity Spreadsheet -- Enzyme Inhibition Constant Data from BindingDB
Found 3 hits for monomerid = 50379112
TargetAdenosine receptor A3(Homo sapiens (Human))
TBA
Curated by ChEMBL
LigandPNGBDBM50379112(CHEMBL2012693)
Affinity DataKi:  40.4nM. Assay description: Displacement of [125I]AB-MECA from human recombinant adenosine receptor-3 expressed in CHO cell membrane after 60 mins by gamma-counting
In DepthDetails ArticlePubMed
TargetAdenosine receptor A1(Homo sapiens (Human))
TBA
Curated by ChEMBL
LigandPNGBDBM50379112(CHEMBL2012693)
Affinity DataKi:  1.91E+3nM. Assay description: Displacement of [3H]R-PIA from human recombinant adenosine receptor-1 expressed in CHO cell membrane after 60 mins by liquid scintillation counting
In DepthDetails ArticlePubMed
TargetAdenosine receptor A2a(Homo sapiens (Human))
TBA
Curated by ChEMBL
LigandPNGBDBM50379112(CHEMBL2012693)
Affinity DataKi:  7.51E+3nM. Assay description: Displacement of [3H]CGS21680 from human recombinant adenosine receptor-2A expressed in HEK293 cell membrane after 60 mins by liquid scintillation cou...
In DepthDetails ArticlePubMed