BDBM50379198 CHEMBL2011277
SMILES Nc1ccc2cc(ccc2n1)-c1ccccc1F
InChI Key InChIKey=WLRRZYUYUADNSQ-UHFFFAOYSA-N
Data  1 Kd
  Tab Delimited (TSV)   2D SDfile   Computed 3D by Vconf -m prep SDfile
Find this compound or compounds like it in BindingDB:
Activity Spreadsheet -- Enzyme Inhibition Constant Data from BindingDB
Found 1 hit for monomerid = 50379198
TargetBeta-secretase 1(Homo sapiens (Human))
Amgen
Curated by ChEMBL
LigandPNGBDBM50379198(CHEMBL2011277)
Affinity DataKd:  3.90E+4nM. Assay description: Binding affinity to BACE1 by surface plasmon resonance method
In DepthDetails ArticlePubMed