BDBM50379543 CHEMBL2012752
SMILES CC[C@@H](NCCCC[C@@H](Cc1cc(C)c(F)c(C)c1)C(=O)NO)c1ccc(F)cc1
InChI Key InChIKey=RKZDOJQKLCPUQZ-RBBKRZOGSA-N
Data  1 KI
  Tab Delimited (TSV)   2D SDfile   Computed 3D by Vconf -m prep SDfile
Find this compound or compounds like it in BindingDB:
Activity Spreadsheet -- Enzyme Inhibition Constant Data from BindingDB
Found 1 hit for monomerid = 50379543
TargetLethal factor(Bacillus anthracis)
Panthera Biopharma
Curated by ChEMBL
LigandPNGBDBM50379543(CHEMBL2012752)
Affinity DataKi:  0.0400nM. Assay description: Inhibition of N-terminal 6-histine tagged Bacillus anthracis LF 263-C terminal catalytic domain using MCA-KKVYPYPME-Dap(Dnp)-NH2 as substrate after 4...
In DepthDetails ArticlePubMed