BDBM50379806 CHEMBL2010811
SMILES COc1ccc(cc1)C1CCNCC1
InChI Key InChIKey=VCRQRAYQLAPLJH-UHFFFAOYSA-N
Data  1 KI
  Tab Delimited (TSV)   2D SDfile   Computed 3D by Vconf -m prep SDfile
Find this compound or compounds like it in BindingDB:
Activity Spreadsheet -- Enzyme Inhibition Constant Data from BindingDB
Found 1 hit for monomerid = 50379806
Target5-hydroxytryptamine receptor 2C(Homo sapiens (Human))
Monash University (Parkville Campus)
Curated by ChEMBL
LigandPNGBDBM50379806(CHEMBL2010811)
Affinity DataKi: >1.00E+4nM. Assay description: Displacement of [3H]-mesulergine from 5HT2C receptor expressed in CHO cell membranes after 90 mins by scintillation counting
In DepthDetails ArticlePubMed