BDBM50380134 CHEMBL2013215
SMILES COc1cc(cc(OC)c1OC)C(=O)N(CCC1CCCN1C)C\C(C)=C\c1ccccc1
InChI Key InChIKey=PYZMBELGBYJDBI-CAPFRKAQSA-N
Data  1 KI
  Tab Delimited (TSV)   2D SDfile   Computed 3D by Vconf -m prep SDfile
Find this compound or compounds like it in BindingDB:
Activity Spreadsheet -- Enzyme Inhibition Constant Data from BindingDB
Found 1 hit for monomerid = 50380134
TargetAtypical chemokine receptor 3(Homo sapiens (Human))
Vu University Amsterdam
Curated by ChEMBL
LigandPNGBDBM50380134(CHEMBL2013215)
Affinity DataKi:  15.8nM. Assay description: Displacement of [125I]-CXCL12 from human CXCR7 expressed in HEK293 cells after 3 hrs
In DepthDetails ArticlePubMed