BDBM50380360 CHEMBL2017957
SMILES CC(=O)N(CC1CCN(Cc2ccc(Cl)cc2)CC1)Cc1ccccc1
InChI Key InChIKey=KOAJMZOLFDIMQB-UHFFFAOYSA-N
Data  1 KI
  Tab Delimited (TSV)   2D SDfile   Computed 3D by Vconf -m prep SDfile
Find this compound or compounds like it in BindingDB:
Activity Spreadsheet -- Enzyme Inhibition Constant Data from BindingDB
Found 1 hit for monomerid = 50380360
LigandPNGBDBM50380360(CHEMBL2017957)
Affinity DataKi:  1.87nM. Assay description: Displacement of [3H]-pentazocine from sigma 1 opioid receptor in rat liver homogenate by liquid scintillation counting
In DepthDetails ArticlePubMed