BDBM50380634 CHEMBL2017058
SMILES COc1cc2CCn3c(C)nc(-c4cncs4)c3-c2cc1OC
InChI Key InChIKey=OQHKHTONZCAETM-UHFFFAOYSA-N
Data  4 KI
  Tab Delimited (TSV)   2D SDfile   Computed 3D by Vconf -m prep SDfile
Find this compound or compounds like it in BindingDB:
Activity Spreadsheet -- Enzyme Inhibition Constant Data from BindingDB
Found 4 hits for monomerid = 50380634
TargetcAMP and cAMP-inhibited cGMP 3',5'-cyclic phosphodiesterase 10A(Homo sapiens (Human))
Merck Research Laboratories
Curated by ChEMBL
LigandPNGBDBM50380634(CHEMBL2017058)
Affinity DataKi:  20nM. Assay description: Inhibition of human recombinant PDE10A assessed as inhibition of [3H]cAMP hydrolysis by scintillation proximity assay
In DepthDetails ArticlePubMed
TargetcGMP-inhibited 3',5'-cyclic phosphodiesterase 3A(Homo sapiens (Human))
Merck Research Laboratories
Curated by ChEMBL
LigandPNGBDBM50380634(CHEMBL2017058)
Affinity DataKi:  968nM. Assay description: Inhibition of human recombinant PDE3A assessed as inhibition of [3H]cAMP hydrolysis by scintillation proximity assay
In DepthDetails ArticlePubMed
TargetHigh affinity cAMP-specific 3',5'-cyclic phosphodiesterase 7A(Homo sapiens (Human))
Merck Research Laboratories
Curated by ChEMBL
LigandPNGBDBM50380634(CHEMBL2017058)
Affinity DataKi:  6.12E+3nM. Assay description: Inhibition of human recombinant PDE7A1 assessed as inhibition of [3H]cAMP hydrolysis by scintillation proximity assay
In DepthDetails ArticlePubMed
TargetcGMP-specific 3',5'-cyclic phosphodiesterase(Homo sapiens (Human))
Merck Research Laboratories
Curated by ChEMBL
LigandPNGBDBM50380634(CHEMBL2017058)
Affinity DataKi: >7.10E+3nM. Assay description: Inhibition of human recombinant PDE5 assessed as inhibition of [3H]cAMP hydrolysis by scintillation proximity assay
In DepthDetails ArticlePubMed