BDBM50380641 CHEMBL2017065
SMILES COc1cc2CCn3cnc(-c4cnc(s4)N4CCOCC4)c3-c2cc1OC
InChI Key InChIKey=WIWOBGNIVSRLMD-UHFFFAOYSA-N
Data  3 KI  1 IC50
  Tab Delimited (TSV)   2D SDfile   Computed 3D by Vconf -m prep SDfile
Find this compound or compounds like it in BindingDB:
Activity Spreadsheet -- Enzyme Inhibition Constant Data from BindingDB
Found 4 hits for monomerid = 50380641
TargetcAMP and cAMP-inhibited cGMP 3',5'-cyclic phosphodiesterase 10A(Homo sapiens (Human))
Merck Research Laboratories
Curated by ChEMBL
LigandPNGBDBM50380641(CHEMBL2017065)
Affinity DataKi:  26nM. Assay description: Inhibition of human recombinant PDE10A assessed as inhibition of [3H]cAMP hydrolysis by scintillation proximity assay
In DepthDetails ArticlePubMed
TargetcGMP-inhibited 3',5'-cyclic phosphodiesterase 3A(Homo sapiens (Human))
Merck Research Laboratories
Curated by ChEMBL
LigandPNGBDBM50380641(CHEMBL2017065)
Affinity DataKi:  177nM. Assay description: Inhibition of human recombinant PDE3A assessed as inhibition of [3H]cAMP hydrolysis by scintillation proximity assay
In DepthDetails ArticlePubMed
TargetHigh affinity cAMP-specific 3',5'-cyclic phosphodiesterase 7A(Homo sapiens (Human))
Merck Research Laboratories
Curated by ChEMBL
LigandPNGBDBM50380641(CHEMBL2017065)
Affinity DataKi:  2.47E+3nM. Assay description: Inhibition of human recombinant PDE7A1 assessed as inhibition of [3H]cAMP hydrolysis by scintillation proximity assay
In DepthDetails ArticlePubMed
TargetcAMP and cAMP-inhibited cGMP 3',5'-cyclic phosphodiesterase 10A(Homo sapiens (Human))
Merck Research Laboratories
Curated by ChEMBL
LigandPNGBDBM50380641(CHEMBL2017065)
Affinity DataIC50: <10nM. Assay description: Inhibition of PDE10A using [3H]cAMP and [3H]cGMP as substrate after 30 mins by scintillation counting
In DepthDetails ArticlePubMed