BDBM50382219 CHEMBL2023843
SMILES [#7]-[#6]-[#6]-[#6]-[#6]-[#6@@H](-[#7]-[#6](=O)-[#6]-[#6]-[#6]-[#6]-[#6]-[#6]-[#6]-[#7]-1-[#6]-[#6]-[#6]-[#7](-[#6]-[#6]-1)S(=O)(=O)c1cccc2cnccc12)-[#6](=O)-[#7]-[#6]-[#6]-[#6]-[#6]-[#6]-[#6](=O)-[#7]-[#6@H](-[#6]-[#6]-[#6]\[#7]=[#6](\[#7])-[#7])-[#6](=O)-[#7]-[#6@H](-[#6]-[#6]-[#6]\[#7]=[#6](\[#7])-[#7])-[#6](=O)-[#7]-[#6@H](-[#6]-[#6]-[#6]\[#7]=[#6](\[#7])-[#7])-[#6](=O)-[#7]-[#6@H](-[#6]-[#6]-[#6]\[#7]=[#6](\[#7])-[#7])-[#6](=O)-[#7]-[#6@H](-[#6]-[#6]-[#6]\[#7]=[#6](\[#7])-[#7])-[#6](=O)-[#7]-[#6@H](-[#6]-[#6]-[#6]\[#7]=[#6](\[#7])-[#7])-[#6](-[#7])=O
InChI Key InChIKey=GEFZKSCXGJGQEM-HABJHIKCSA-N
Data  1 IC50  1 Kd
  Tab Delimited (TSV)   2D SDfile   Computed 3D by Vconf -m prep SDfile
Find this compound or compounds like it in BindingDB:
Activity Spreadsheet -- Enzyme Inhibition Constant Data from BindingDB
Found 2 hits for monomerid = 50382219
TargetRho-associated protein kinase 2(Homo sapiens (Human))
University Of Tartu
Curated by ChEMBL
LigandPNGBDBM50382219(CHEMBL2023843)
Affinity DataKd:  0.0200nM. Assay description: Displacement of fluorescent-ARC-1063 from His6-tagged recombinant human ROCK2 by luminescence intensity assay
In DepthDetails ArticlePubMed
TargetRho-associated protein kinase 2(Homo sapiens (Human))
University Of Tartu
Curated by ChEMBL
LigandPNGBDBM50382219(CHEMBL2023843)
Affinity DataIC50:  10nM. Assay description: Displacement of fluorescent-ARC-1063 from His6-tagged recombinant human ROCK2 by luminescence intensity assay
In DepthDetails ArticlePubMed