BDBM50382301 CHEMBL2024515
SMILES CS(=O)(=O)N[C@H]1CC[C@H](CCN2CCN(CC2)c2cccc(Cl)c2Cl)CC1
InChI Key InChIKey=MEEYWSYFAMXWHM-WKILWMFISA-N
Data  2 IC50
  Tab Delimited (TSV)   2D SDfile   Computed 3D by Vconf -m prep SDfile
Find this compound or compounds like it in BindingDB:
Activity Spreadsheet -- Enzyme Inhibition Constant Data from BindingDB
Found 2 hits for monomerid = 50382301
TargetD(2) dopamine receptor(Rattus norvegicus (rat))
Gedeon Richter
Curated by ChEMBL
LigandPNGBDBM50382301(CHEMBL2024515)
Affinity DataIC50:  5.40nM. Assay description: Displacement of [3H]spiperone from dopamine D2 receptor in rat striatal membranes
In DepthDetails ArticlePubMed
TargetD(3) dopamine receptor(Rattus norvegicus (Rat))
Gedeon Richter
Curated by ChEMBL
LigandPNGBDBM50382301(CHEMBL2024515)
Affinity DataIC50:  0.480nM. Assay description: Displacement of [3H]spiperone from rat recombinant dopamine D3 receptor expressed in Sf9 cells
In DepthDetails ArticlePubMed