BDBM50383916 CHEMBL2031657
SMILES O=c1[nH]nc(o1)-c1ccc(OCc2ccc3ccccc3n2)cc1[C@]1(C[C@H]2CC[C@H]1C2)c1ccccc1
InChI Key InChIKey=ZIHNYOCWCTUVGW-OJCKMMRBSA-N
Data  2 IC50
  Tab Delimited (TSV)   2D SDfile   Computed 3D by Vconf -m prep SDfile
Find this compound or compounds like it in BindingDB:
Activity Spreadsheet -- Enzyme Inhibition Constant Data from BindingDB
Found 2 hits for monomerid = 50383916
TargetArachidonate 5-lipoxygenase-activating protein(Homo sapiens (Human))
Merck Research Laboratories
Curated by ChEMBL
LigandPNGBDBM50383916(CHEMBL2031657)
Affinity DataIC50:  469nM. Assay description: Inhibition of 5-lipoxygenase-activating protein in human polymorphonuclear cells assessed as inhibition of calcium ionophore-induced LTB4 production ...
In DepthDetails ArticlePubMed
TargetArachidonate 5-lipoxygenase-activating protein(Homo sapiens (Human))
Merck Research Laboratories
Curated by ChEMBL
LigandPNGBDBM50383916(CHEMBL2031657)
Affinity DataIC50:  0.800nM. Assay description: Displacement of [125I]L-691,831 from 5-lipoxygenase-activating protein in human polymorphonuclear cells
In DepthDetails ArticlePubMed