BDBM50384691 CHEMBL2037125
SMILES Cn1cc(C(=O)Nc2ccc(-c3ccccc3)c(c2)C(F)(F)F)c(=O)c2ccc(CCCO)cc12
InChI Key InChIKey=GPQBJOGXUGDSEF-UHFFFAOYSA-N
Data  2 EC50
  Tab Delimited (TSV)   2D SDfile   Computed 3D by Vconf -m prep SDfile
Find this compound or compounds like it in BindingDB:
Activity Spreadsheet -- Enzyme Inhibition Constant Data from BindingDB
Found 2 hits for monomerid = 50384691
TargetSphingosine 1-phosphate receptor 3(Homo sapiens (Human))
TBA
Curated by ChEMBL
LigandPNGBDBM50384691(CHEMBL2037125)
Affinity DataEC50: >2.50E+4nM. Assay description: Agonist activity at human S1P3 receptor expressed in CHO cells coexpressing Gq/i5 G-protein assessed as Ca2+ mobilization after 60 to 90 mins by FLIP...
In DepthDetails ArticlePubMed
TargetSphingosine 1-phosphate receptor 1(Homo sapiens (Human))
TBA
Curated by ChEMBL
LigandPNGBDBM50384691(CHEMBL2037125)
Affinity DataEC50:  15nM. Assay description: Agonist activity at human S1P1 receptor expressed in human U2OS cells co-expressing eGFP assessed as receptor internalization after 1 hr
In DepthDetails ArticlePubMed