BDBM50384951 CHEMBL2037387
SMILES Clc1ccc2c(NCCCCNCc3ccc(cc3)-c3ccc(s3)-c3ccc(CNCCCCNc4ccnc5cc(Cl)ccc45)cc3)ccnc2c1
InChI Key InChIKey=YADTUKIPRCONOT-UHFFFAOYSA-N
Data  1 KI
  Tab Delimited (TSV)   2D SDfile   Computed 3D by Vconf -m prep SDfile
Find this compound or compounds like it in BindingDB:
Activity Spreadsheet -- Enzyme Inhibition Constant Data from BindingDB
Found 1 hit for monomerid = 50384951
TargetBotulinum neurotoxin type A(Clostridium botulinum)
University Of Belgrade
Curated by ChEMBL
LigandPNGBDBM50384951(CHEMBL2037387)
Affinity DataKi:  535nM. Assay description: Competitive inhibition of clostridium botulinum Botulinum neurotoxin type A light chain by RP-HPLC analysis
In DepthDetails ArticlePubMed