BDBM50385103 CHEMBL2035883
SMILES CC(C)c1cc(Oc2c3CCCc3c(NS(=O)(=O)CC(O)=O)cc2C)ccc1O
InChI Key InChIKey=INVAEJCVXVGXIA-UHFFFAOYSA-N
Data  2 KI
  Tab Delimited (TSV)   2D SDfile   Computed 3D by Vconf -m prep SDfile
Find this compound or compounds like it in BindingDB:
Activity Spreadsheet -- Enzyme Inhibition Constant Data from BindingDB
Found 2 hits for monomerid = 50385103
TargetThyroid hormone receptor beta(Homo sapiens (Human))
Kissei Pharmaceutical
Curated by ChEMBL
LigandPNGBDBM50385103(CHEMBL2035883)
Affinity DataKi:  213nM. Assay description: Displacement of [125I]T3 from human recombinant thyroid harmone receptor beta after 16 to 48 hrs by gamma-ray detection
In DepthDetails ArticlePubMed
TargetThyroid hormone receptor alpha(Homo sapiens (Human))
Kissei Pharmaceutical
Curated by ChEMBL
LigandPNGBDBM50385103(CHEMBL2035883)
Affinity DataKi:  1.25E+3nM. Assay description: Displacement of [125I]T3 from human recombinant thyroid harmone receptor alpha after 16 to 48 hrs by gamma-ray detection
In DepthDetails ArticlePubMed