BDBM50385411 CHEMBL2036582
SMILES CCCCOc1ccc(NC(=O)c2nnc(Nc3ccccc3F)o2)cn1
InChI Key InChIKey=QBGBBYDVZKAYQR-UHFFFAOYSA-N
Data  1 IC50
  Tab Delimited (TSV)   2D SDfile   Computed 3D by Vconf -m prep SDfile
Find this compound or compounds like it in BindingDB:
Activity Spreadsheet -- Enzyme Inhibition Constant Data from BindingDB
Found 1 hit for monomerid = 50385411
TargetDiacylglycerol O-acyltransferase 1(Homo sapiens (Human))
Astrazeneca
Curated by ChEMBL
LigandPNGBDBM50385411(CHEMBL2036582)
Affinity DataIC50:  60nM. Assay description: Inhibition of human recombinant DGAT1 expressed in baculovirus infected insect sf9 cells using [14C] oleoyl coenzyme A after 30 mins by scintillation...
In DepthDetails ArticlePubMed