BDBM50385413 CHEMBL2036584
SMILES Fc1ccccc1Nc1nnc(o1)C(=O)Nc1ccc(Oc2cccnc2)nc1
InChI Key InChIKey=AXJPXNNQSIMWMD-UHFFFAOYSA-N
Data  1 IC50
  Tab Delimited (TSV)   2D SDfile   Computed 3D by Vconf -m prep SDfile
Find this compound or compounds like it in BindingDB:
Activity Spreadsheet -- Enzyme Inhibition Constant Data from BindingDB
Found 1 hit for monomerid = 50385413
TargetDiacylglycerol O-acyltransferase 1(Homo sapiens (Human))
Astrazeneca
Curated by ChEMBL
LigandPNGBDBM50385413(CHEMBL2036584)
Affinity DataIC50:  410nM. Assay description: Inhibition of human recombinant DGAT1 expressed in baculovirus infected insect sf9 cells using [14C] oleoyl coenzyme A after 30 mins by scintillation...
In DepthDetails ArticlePubMed