BDBM50385902 CHEMBL2041596
SMILES COc1cc(COC(=O)c2ccc(o2)-c2ccccc2)cc(OC)c1OC
InChI Key InChIKey=OBCOHPZTBGFKMG-UHFFFAOYSA-N
Data  1 KI  5 IC50
  Tab Delimited (TSV)   2D SDfile   Computed 3D by Vconf -m prep SDfile
Find this compound or compounds like it in BindingDB:
Activity Spreadsheet -- Enzyme Inhibition Constant Data from BindingDB
Found 6 hits for monomerid = 50385902
TargetHigh affinity cAMP-specific 3',5'-cyclic phosphodiesterase 7A(Homo sapiens (Human))
Instituto De Qu£Mica M£Dica (Csic)
Curated by ChEMBL
LigandPNGBDBM50385902(CHEMBL2041596)
Affinity DataKi:  5.91E+3nM. Assay description: Competitive inhibition of human recombinant PDE7A1 using 5 nM to 2 uM cAMP as substrate by Lineweaver-Burk plot analysis
In DepthDetails ArticlePubMed
TargetcAMP-specific 3',5'-cyclic phosphodiesterase 4D(Homo sapiens (Human))
Instituto De Qu£Mica M£Dica (Csic)
Curated by ChEMBL
LigandPNGBDBM50385902(CHEMBL2041596)
Affinity DataIC50:  6.63E+4nM. Assay description: Inhibition of human recombinant PDE4D3 using fluorscein 3',5'-cyclic phosphate after 60 mins by IMAP fluorescence polarization assay
In DepthDetails ArticlePubMed
TargetcGMP-inhibited 3',5'-cyclic phosphodiesterase 3A(Homo sapiens (Human))
Instituto De Qu£Mica M£Dica (Csic)
Curated by ChEMBL
LigandPNGBDBM50385902(CHEMBL2041596)
Affinity DataIC50:  5.46E+4nM. Assay description: Inhibition of human recombinant PDE3A-mediated [3H]cAMP hydrolysis after 20 mins by scintillation proximity assay
In DepthDetails ArticlePubMed
TargetcAMP-specific 3',5'-cyclic phosphodiesterase 4B(Homo sapiens (Human))
Instituto De Qu£Mica M£Dica (Csic)
Curated by ChEMBL
LigandPNGBDBM50385902(CHEMBL2041596)
Affinity DataIC50:  1.24E+4nM. Assay description: Inhibition of human recombinant PDE4B2 using fluorscein 3',5'-cyclic phosphate after 60 mins by IMAP fluorescence polarization assay
In DepthDetails ArticlePubMed
TargetHigh affinity cAMP-specific 3',5'-cyclic phosphodiesterase 7A/cAMP-specific 3',5'-cyclic phosphodiesterase 7B(Homo sapiens (Human))
Centro De Investigaciones Biol�Gicas (Csic)
Curated by ChEMBL
LigandPNGBDBM50385902(CHEMBL2041596)
Affinity DataIC50:  5.17E+3nM. Assay description: Inhibition of PDE7 (unknown origin)
In DepthDetails ArticlePubMed
TargetHigh affinity cAMP-specific 3',5'-cyclic phosphodiesterase 7A(Homo sapiens (Human))
Instituto De Qu£Mica M£Dica (Csic)
Curated by ChEMBL
LigandPNGBDBM50385902(CHEMBL2041596)
Affinity DataIC50:  5.17E+3nM. Assay description: Inhibition of human recombinant PDE7A1-mediated [3H]cAMP hydrolysis after 20 mins by scintillation proximity assay
In DepthDetails ArticlePubMed