BDBM50386341 CHEMBL2048404
SMILES CN(C)S(=O)(=O)c1cccc(C[C@H](NC(=O)c2c(Cl)cc3CN(CCc3c2Cl)C(=O)c2ccc3ccoc3c2)C(O)=O)c1
InChI Key InChIKey=QQSAZMAJLFVCGT-DEOSSOPVSA-N
Data  2 IC50
  Tab Delimited (TSV)   2D SDfile   Computed 3D by Vconf -m prep SDfile
Find this compound or compounds like it in BindingDB:
Activity Spreadsheet -- Enzyme Inhibition Constant Data from BindingDB
Found 2 hits for monomerid = 50386341
LigandPNGBDBM50386341(CHEMBL2048404)
Affinity DataIC50: >1.00E+4nM. Assay description: Antagonist activity at LFA-1/ICAM-1 in human HuT-78 T-cells assessed as inhibition of cell adhesion after 1 hr by p-nitrophenyl n-acetyl-beta-D-gluco...
In DepthDetails ArticlePubMed
LigandPNGBDBM50386341(CHEMBL2048404)
Affinity DataIC50:  10nM. Assay description: Antagonist activity at LFA-1/ICAM-1 in human HuT-78 T-cells assessed as inhibition of cell adhesion after 1 hr by p-nitrophenyl n-acetyl-beta-D-gluco...
In DepthDetails ArticlePubMed