BDBM50386766 CHEMBL2046905
SMILES Nc1nc2n(c[n+](CCOc3ccc(Cl)cc3)c2c(=O)[nH]1)[C@@H]1O[C@H](COP(O)([O-])=O)[C@@H](O)[C@H]1O
InChI Key InChIKey=QWFXGVANFMDSMH-LSCFUAHRSA-N
Data  2 IC50
  Tab Delimited (TSV)   2D SDfile   Computed 3D by Vconf -m prep SDfile
Find this compound or compounds like it in BindingDB:
Activity Spreadsheet -- Enzyme Inhibition Constant Data from BindingDB
Found 2 hits for monomerid = 50386766
TargetEukaryotic translation initiation factor 4E(Oryctolagus cuniculus)
Amgen
Curated by ChEMBL
LigandPNGBDBM50386766(CHEMBL2046905)
Affinity DataIC50:  1.90E+3nM. Assay description: Inhibition of eIF4E in rabbit reticulocyte cell lysate assessed as inhibition of cap-dependent translation after 90 mins by luciferase reporter gene ...
In DepthDetails ArticlePubMed
TargetEukaryotic translation initiation factor 4E(Homo sapiens (Human))
Amgen
Curated by ChEMBL
LigandPNGBDBM50386766(CHEMBL2046905)
Affinity DataIC50:  59nM. Assay description: Competitive inhibition of [3H]m7-GTP binding to human FLAG-His6 tagged eIF4E expressed in Escherichia coli by scintillation proximity assay
In DepthDetails ArticlePubMed