BDBM50386869 CHEMBL2048340
SMILES Oc1c(Br)cc(cc1Br)C(=O)c1nccc2c3ccc(Br)cc3[nH]c12
InChI Key InChIKey=JIBBXIBLZPCSSH-UHFFFAOYSA-N
Data  1 IC50
  Tab Delimited (TSV)   2D SDfile   Computed 3D by Vconf -m prep SDfile
Find this compound or compounds like it in BindingDB:
Activity Spreadsheet -- Enzyme Inhibition Constant Data from BindingDB
Found 1 hit for monomerid = 50386869
TargetSortase family protein(Staphylococcus aureus)
Seoul National University
Curated by ChEMBL
LigandPNGBDBM50386869(CHEMBL2048340)
Affinity DataIC50: >1.91E+5nM. Assay description: Inhibition of Staphylococcus aureus ATCC 6538p recombinant SrtA
In DepthDetails ArticlePubMed