BDBM50386946 CHEMBL2048811
SMILES COc1ccc(OCC(=O)N2CCC3(CN(Cc4ccc(cc4)-c4nnc(C)o4)C3)CC2)cc1
InChI Key InChIKey=RFHKLBUHNHHKDG-UHFFFAOYSA-N
Data  1 KI  1 IC50
  Tab Delimited (TSV)   2D SDfile   Computed 3D by Vconf -m prep SDfile
Find this compound or compounds like it in BindingDB:
Activity Spreadsheet -- Enzyme Inhibition Constant Data from BindingDB
Found 2 hits for monomerid = 50386946
TargetGrowth hormone secretagogue receptor type 1(Homo sapiens (Human))
Pfizer
Curated by ChEMBL
LigandPNGBDBM50386946(CHEMBL2048811)
Affinity DataKi:  52nM. Assay description: Antagonist activity at human GHS-R1a expressed in HEK293 cells assessed as inhibition of ghrelin-induced europium-labeled GTP binding by DELFIA
In DepthDetails ArticlePubMed
TargetGrowth hormone secretagogue receptor type 1(Homo sapiens (Human))
Pfizer
Curated by ChEMBL
LigandPNGBDBM50386946(CHEMBL2048811)
Affinity DataIC50:  1.07E+3nM. Assay description: Displacement of [125I]Ghrelin from human GHS-R1a expressed in HEK293 cells after 8 hrs by SPA
In DepthDetails ArticlePubMed