BDBM50387893 CHEMBL2058391
SMILES CC(C)(C)OC(=O)N1CCC(CCCNc2ccc3c(CCS3(=O)=O)c2)CC1
InChI Key InChIKey=CYNURBUBXQDYMK-UHFFFAOYSA-N
Data  2 EC50
  Tab Delimited (TSV)   2D SDfile   Computed 3D by Vconf -m prep SDfile
Find this compound or compounds like it in BindingDB:
Activity Spreadsheet -- Enzyme Inhibition Constant Data from BindingDB
Found 2 hits for monomerid = 50387893
TargetGlucose-dependent insulinotropic receptor(Mus musculus)
Sanwa Kagaku Kenkyusho
Curated by ChEMBL
LigandPNGBDBM50387893(CHEMBL2058391)
Affinity DataEC50:  224nM. Assay description: Agonist activity at mouse GPR119 receptor expressed in CHO-K1 cells assessed as cAMP accumulation after 30 mins by HTRF assay
In DepthDetails ArticlePubMed
TargetGlucose-dependent insulinotropic receptor(Homo sapiens (Human))
Sanwa Kagaku Kenkyusho
Curated by ChEMBL
LigandPNGBDBM50387893(CHEMBL2058391)
Affinity DataEC50:  270nM. Assay description: Agonist activity at human GPR119 receptor expressed in CHO-K1 cells assessed as cAMP accumulation after 30 mins by HTRF assay
In DepthDetails ArticlePubMed