BDBM50387974 CHEMBL2057830
SMILES Oc1ccc(cc1)C1=NN2C(S1)=NC(=O)\C(=C\c1ccc(O)c(O)c1)C2=N
InChI Key InChIKey=FKGLDYLQFIXPLH-CRKOOCFNSA-N
Data  7 IC50
  Tab Delimited (TSV)   2D SDfile   Computed 3D by Vconf -m prep SDfile
Find this compound or compounds like it in BindingDB:
Activity Spreadsheet -- Enzyme Inhibition Constant Data from BindingDB
Found 7 hits for monomerid = 50387974
TargetDual specificity protein phosphatase 4(Homo sapiens (Human))
Sejong University
Curated by ChEMBL
LigandPNGBDBM50387974(CHEMBL2057830)
Affinity DataIC50: >1.00E+5nM. Assay description: Inhibition of MKP2
In DepthDetails ArticlePubMed
TargetProtein-tyrosine-phosphatase(Homo sapiens (Human))
Sejong University
Curated by ChEMBL
LigandPNGBDBM50387974(CHEMBL2057830)
Affinity DataIC50:  1.20E+3nM. Assay description: Inhibition of His-tagged PTPsigma catalytic domain amino acid 1369 to 1948 using DiFMUP as substrate after 20 mins by spectrofluorometric analysis
In DepthDetails ArticlePubMed
TargetProtein tyrosine phosphatase type IVA 1(Homo sapiens (Human))
Sejong University
Curated by ChEMBL
LigandPNGBDBM50387974(CHEMBL2057830)
Affinity DataIC50:  3.98E+4nM. Assay description: Inhibition of PRL1
In DepthDetails ArticlePubMed
TargetPhosphatidylinositol 4,5-bisphosphate 3-kinase catalytic subunit alpha isoform(Homo sapiens (Human))
Sejong University
Curated by ChEMBL
LigandPNGBDBM50387974(CHEMBL2057830)
Affinity DataIC50:  300nM. Assay description: Inhibition of PI3Kalpha using [gamma32P]ATP by radiometric kinase assay
In DepthDetails ArticlePubMed
TargetDual specificity mitogen-activated protein kinase kinase 2(Homo sapiens (Human))
Sejong University
Curated by ChEMBL
LigandPNGBDBM50387974(CHEMBL2057830)
Affinity DataIC50:  1.30E+3nM. Assay description: Inhibition of MEK2 using [gamma32P]ATP by radiometric kinase assay
In DepthDetails ArticlePubMed
TargetDual specificity mitogen-activated protein kinase kinase 1(Homo sapiens (Human))
Sejong University
Curated by ChEMBL
LigandPNGBDBM50387974(CHEMBL2057830)
Affinity DataIC50:  2.20E+3nM. Assay description: Inhibition of MEK1 using [gamma32P]ATP by radiometric kinase assay
In DepthDetails ArticlePubMed
TargetProtein tyrosine phosphatase type IVA 3(Homo sapiens (Human))
Sejong University
Curated by ChEMBL
LigandPNGBDBM50387974(CHEMBL2057830)
Affinity DataIC50:  3.32E+4nM. Assay description: Inhibition of PRL3
In DepthDetails ArticlePubMed