BDBM50388929 CHEMBL2063400
SMILES NCCCC[C@@H]1SC[C@@H]2NC(=O)N[C@H]12
InChI Key InChIKey=KRWAZHNVQMITHZ-FXQIFTODSA-N
Data  1 KI
  Tab Delimited (TSV)   2D SDfile   Computed 3D by Vconf -m prep SDfile
Find this compound or compounds like it in BindingDB:
Activity Spreadsheet -- Enzyme Inhibition Constant Data from BindingDB
Found 1 hit for monomerid = 50388929
TargetBiotin--protein ligase(Homo sapiens (Human))
TBA
Curated by ChEMBL
LigandPNGBDBM50388929(CHEMBL2063400)
Affinity DataKi: >2.00E+4nM. Assay description: Displacement of [3H]-biotin from human BPL after 20 mins by scintillation counting
In DepthDetails ArticlePubMed