BDBM50389147 CHEMBL2064655
SMILES CNC(=O)[C@@]12C[C@@H]1[C@H]([C@H](O)[C@@H]2O)n1cnc2c(NCc3cccc(Cl)c3)nc(nc12)C#Cc1ccccc1Cl
InChI Key InChIKey=CYJIIKWKVVDPGM-JIGPFOKVSA-N
Data  2 KI
  Tab Delimited (TSV)   2D SDfile   Computed 3D by Vconf -m prep SDfile
Find this compound or compounds like it in BindingDB:
Activity Spreadsheet -- Enzyme Inhibition Constant Data from BindingDB
Found 2 hits for monomerid = 50389147
TargetAdenosine receptor A3(Homo sapiens (Human))
National Institute Of Diabetes And Digestive And Kidney Diseases
Curated by ChEMBL
LigandPNGBDBM50389147(CHEMBL2064655)
Affinity DataKi:  1.90nM. Assay description: Displacement of [3H]I-AB-MECA from human recombinant adenosine A3 receptor expressed in CHO cells after 60 mins by gamma counting
In DepthDetails ArticlePubMed
TargetAdenosine receptor A3(Mus musculus)
National Institute Of Diabetes And Digestive And Kidney Diseases
Curated by ChEMBL
LigandPNGBDBM50389147(CHEMBL2064655)
Affinity DataKi:  2.60nM. Assay description: Displacement of [3H]CGS21680 from mouse adenosine A3 receptor expressed in HEK293 cells after 60 mins by liquid scintillation counting
In DepthDetails ArticlePubMed