BDBM50389316 CHEMBL2063921
SMILES CSc1ccccc1Nc1nc(nc2c(NCC3CC3)ncnc12)N1C2CCC1CC(N)C2
InChI Key InChIKey=XUOOGUVZBHEGBA-UHFFFAOYSA-N
Data  1 IC50
  Tab Delimited (TSV)   2D SDfile   Computed 3D by Vconf -m prep SDfile
Find this compound or compounds like it in BindingDB:
Activity Spreadsheet -- Enzyme Inhibition Constant Data from BindingDB
Found 1 hit for monomerid = 50389316
TargetKetohexokinase(Homo sapiens (Human))
Janssen Pharmaceutical Companies Of Johnson & Johnson
Curated by ChEMBL
LigandPNGBDBM50389316(CHEMBL2063921)
Affinity DataIC50:  800nM. Assay description: Inhibition of recombinant human hepatic KHKC
In DepthDetails ArticlePubMed