BDBM50389621 CHEMBL2069762::CHEMBL2069784
SMILES COc1ccc(cc1)[C@@H]1N(Oc2c(O)n(c(O)c12)-c1ccc(cc1)C(O)=O)c1ccccc1
InChI Key InChIKey=SOYYOVUCJKOPDH-NRFANRHFSA-N
Data  2 IC50
  Tab Delimited (TSV)   2D SDfile   Computed 3D by Vconf -m prep SDfile
Find this compound or compounds like it in BindingDB:
Activity Spreadsheet -- Enzyme Inhibition Constant Data from BindingDB
Found 2 hits for monomerid = 50389621
TargetAcetylcholinesterase(Rattus norvegicus (rat))
Punjabi University
Curated by ChEMBL
LigandPNGBDBM50389621(CHEMBL2069762 | CHEMBL2069784)
Affinity DataIC50:  18.8nM. Assay description: Inhibition of AChE activity in rat brain homogenate using acetylthiocholine as substrate by Ellman's method
In DepthDetails ArticlePubMed
TargetAcetylcholinesterase(Rattus norvegicus (rat))
Punjabi University
Curated by ChEMBL
LigandPNGBDBM50389621(CHEMBL2069762 | CHEMBL2069784)
Affinity DataIC50:  19.1nM. Assay description: Inhibition of AChE activity in rat brain homogenate using acetylthiocholine as substrate by Ellman's method
In DepthDetails ArticlePubMed