BDBM50389628 CHEMBL2069646::CHEMBL2069777
SMILES OC(=O)c1ccc(cc1)-n1c(O)c2ON([C@H](c2c1O)c1ccccc1O)c1ccccc1
InChI Key InChIKey=AEUGEDYPAHZHGE-FQEVSTJZSA-N
Data  2 IC50
  Tab Delimited (TSV)   2D SDfile   Computed 3D by Vconf -m prep SDfile
Find this compound or compounds like it in BindingDB:
Activity Spreadsheet -- Enzyme Inhibition Constant Data from BindingDB
Found 2 hits for monomerid = 50389628
TargetAcetylcholinesterase(Rattus norvegicus (rat))
Punjabi University
Curated by ChEMBL
LigandPNGBDBM50389628(CHEMBL2069646 | CHEMBL2069777)
Affinity DataIC50:  23.9nM. Assay description: Inhibition of AChE activity in rat brain homogenate using acetylthiocholine as substrate by Ellman's method
In DepthDetails ArticlePubMed
TargetAcetylcholinesterase(Rattus norvegicus (rat))
Punjabi University
Curated by ChEMBL
LigandPNGBDBM50389628(CHEMBL2069646 | CHEMBL2069777)
Affinity DataIC50:  24.8nM. Assay description: Inhibition of AChE activity in rat brain homogenate using acetylthiocholine as substrate by Ellman's method
In DepthDetails ArticlePubMed