BDBM50389895 CHEMBL2071049
SMILES COc1ccc(CNC(=O)N2CCC(CC2)NC(=O)Nc2nc3nn(C)cc3c3nc(nn23)-c2ccco2)cc1
InChI Key InChIKey=KLHSAPDOXFVSLI-UHFFFAOYSA-N
Data  3 KI  2 IC50
  Tab Delimited (TSV)   2D SDfile   Computed 3D by Vconf -m prep SDfile
Find this compound or compounds like it in BindingDB:
Activity Spreadsheet -- Enzyme Inhibition Constant Data from BindingDB
Found 5 hits for monomerid = 50389895
TargetAdenosine receptor A3(Homo sapiens (Human))
Universit£
Curated by ChEMBL
LigandPNGBDBM50389895(CHEMBL2071049)
Affinity DataKi:  10nM. Assay description: Displacement of [3H]MRE-3008-F20 from human adenosine A3 receptor expressed in CHO cells after 120 mins by scintillation counter
In DepthDetails ArticlePubMed
TargetAdenosine receptor A1(Homo sapiens (Human))
Universit£
Curated by ChEMBL
LigandPNGBDBM50389895(CHEMBL2071049)
Affinity DataKi:  635nM. Assay description: Displacement of [3H]DPCPX from human adenosine A1 receptor expressed in CHO cells after 120 mins by scintillation counter
In DepthDetails ArticlePubMed
TargetAdenosine receptor A2a(Homo sapiens (Human))
Universit£
Curated by ChEMBL
LigandPNGBDBM50389895(CHEMBL2071049)
Affinity DataKi: >5.00E+3nM. Assay description: Displacement of [3H]ZM241385 from human adenosine A2A receptor expressed in CHO cells after 60 mins by scintillation counter
In DepthDetails ArticlePubMed
TargetAdenosine receptor A2b(Homo sapiens (Human))
Universit£
Curated by ChEMBL
LigandPNGBDBM50389895(CHEMBL2071049)
Affinity DataIC50:  3.24E+3nM. Assay description: Antagonist activity at human adenosine A2B receptor expressed in CHO cells assessed as inhibition of NECA-induced cAMP production
In DepthDetails ArticlePubMed
TargetAdenosine receptor A3(Homo sapiens (Human))
Universit£
Curated by ChEMBL
LigandPNGBDBM50389895(CHEMBL2071049)
Affinity DataIC50:  34nM. Assay description: Antagonist activity at human adenosine A3 receptor expressed in CHO cells assessed as forskolin/C1-IB-MECA-induced inhibition of cAMP production
In DepthDetails ArticlePubMed