BDBM50389912 CHEMBL2071039
SMILES CCNC(=O)N1CCC(CC1)NC(=O)Nc1nc2nn(C)cc2c2nc(nn12)-c1ccco1
InChI Key InChIKey=MBUOUBRNUVNUIN-UHFFFAOYSA-N
Data  3 KI  2 IC50
  Tab Delimited (TSV)   2D SDfile   Computed 3D by Vconf -m prep SDfile
Find this compound or compounds like it in BindingDB:
Activity Spreadsheet -- Enzyme Inhibition Constant Data from BindingDB
Found 5 hits for monomerid = 50389912
TargetAdenosine receptor A3(Homo sapiens (Human))
Universit£
Curated by ChEMBL
LigandPNGBDBM50389912(CHEMBL2071039)
Affinity DataKi:  30nM. Assay description: Displacement of [3H]MRE-3008-F20 from human adenosine A3 receptor expressed in CHO cells after 120 mins by scintillation counter
In DepthDetails ArticlePubMed
TargetAdenosine receptor A1(Homo sapiens (Human))
Universit£
Curated by ChEMBL
LigandPNGBDBM50389912(CHEMBL2071039)
Affinity DataKi:  1.50E+3nM. Assay description: Displacement of [3H]DPCPX from human adenosine A1 receptor expressed in CHO cells after 120 mins by scintillation counter
In DepthDetails ArticlePubMed
TargetAdenosine receptor A2a(Homo sapiens (Human))
Universit£
Curated by ChEMBL
LigandPNGBDBM50389912(CHEMBL2071039)
Affinity DataKi: >5.00E+3nM. Assay description: Displacement of [3H]ZM241385 from human adenosine A2A receptor expressed in CHO cells after 60 mins by scintillation counter
In DepthDetails ArticlePubMed
TargetAdenosine receptor A2b(Homo sapiens (Human))
Universit£
Curated by ChEMBL
LigandPNGBDBM50389912(CHEMBL2071039)
Affinity DataIC50: >5.00E+3nM. Assay description: Antagonist activity at human adenosine A2B receptor expressed in CHO cells assessed as inhibition of NECA-induced cAMP production
In DepthDetails ArticlePubMed
TargetAdenosine receptor A3(Homo sapiens (Human))
Universit£
Curated by ChEMBL
LigandPNGBDBM50389912(CHEMBL2071039)
Affinity DataIC50:  116nM. Assay description: Antagonist activity at human adenosine A3 receptor expressed in CHO cells assessed as forskolin/C1-IB-MECA-induced inhibition of cAMP production
In DepthDetails ArticlePubMed