BDBM50389920 CHEMBL2071046
SMILES Cn1cc2c(n1)nc(NC(=O)NC1CCN(CC1)C(=O)NCc1ccc(F)cc1)n1nc(nc21)-c1ccco1
InChI Key InChIKey=QLCUVXNMVMSRNX-UHFFFAOYSA-N
Data  3 KI  2 IC50
  Tab Delimited (TSV)   2D SDfile   Computed 3D by Vconf -m prep SDfile
Find this compound or compounds like it in BindingDB:
Activity Spreadsheet -- Enzyme Inhibition Constant Data from BindingDB
Found 5 hits for monomerid = 50389920
TargetAdenosine receptor A3(Homo sapiens (Human))
Universit£
Curated by ChEMBL
LigandPNGBDBM50389920(CHEMBL2071046)
Affinity DataKi:  4.90nM. Assay description: Displacement of [3H]MRE-3008-F20 from human adenosine A3 receptor expressed in CHO cells after 120 mins by scintillation counter
In DepthDetails ArticlePubMed
TargetAdenosine receptor A1(Homo sapiens (Human))
Universit£
Curated by ChEMBL
LigandPNGBDBM50389920(CHEMBL2071046)
Affinity DataKi:  408nM. Assay description: Displacement of [3H]DPCPX from human adenosine A1 receptor expressed in CHO cells after 120 mins by scintillation counter
In DepthDetails ArticlePubMed
TargetAdenosine receptor A2a(Homo sapiens (Human))
Universit£
Curated by ChEMBL
LigandPNGBDBM50389920(CHEMBL2071046)
Affinity DataKi:  3.26E+3nM. Assay description: Displacement of [3H]ZM241385 from human adenosine A2A receptor expressed in CHO cells after 60 mins by scintillation counter
In DepthDetails ArticlePubMed
TargetAdenosine receptor A2b(Homo sapiens (Human))
Universit£
Curated by ChEMBL
LigandPNGBDBM50389920(CHEMBL2071046)
Affinity DataIC50:  1.04E+3nM. Assay description: Antagonist activity at human adenosine A2B receptor expressed in CHO cells assessed as inhibition of NECA-induced cAMP production
In DepthDetails ArticlePubMed
TargetAdenosine receptor A3(Homo sapiens (Human))
Universit£
Curated by ChEMBL
LigandPNGBDBM50389920(CHEMBL2071046)
Affinity DataIC50:  15nM. Assay description: Antagonist activity at human adenosine A3 receptor expressed in CHO cells assessed as forskolin/C1-IB-MECA-induced inhibition of cAMP production
In DepthDetails ArticlePubMed