BDBM50390277 CHEMBL2070739
SMILES FC(F)(F)c1nc(NCc2cccnc2)c2nnn(CC3CCCCO3)c2n1
InChI Key InChIKey=PRBLJPUUBHCXHM-UHFFFAOYSA-N
Data  1 IC50
  Tab Delimited (TSV)   2D SDfile   Computed 3D by Vconf -m prep SDfile
Find this compound or compounds like it in BindingDB:
Activity Spreadsheet -- Enzyme Inhibition Constant Data from BindingDB
Found 1 hit for monomerid = 50390277
LigandPNGBDBM50390277(CHEMBL2070739)
Affinity DataIC50: >420nM. Assay description: Inhibition of PDE8B expressed in Sf9 insect cells
In DepthDetails ArticlePubMed