BDBM50390305 CHEMBL2070767
SMILES COc1ccc(Cn2nnc3c(N)nc(nc23)C(N)=O)cc1
InChI Key InChIKey=SGFOYQHLHJGSQI-UHFFFAOYSA-N
Data  1 IC50
  Tab Delimited (TSV)   2D SDfile   Computed 3D by Vconf -m prep SDfile
Find this compound or compounds like it in BindingDB:
Activity Spreadsheet -- Enzyme Inhibition Constant Data from BindingDB
Found 1 hit for monomerid = 50390305
LigandPNGBDBM50390305(CHEMBL2070767)
Affinity DataIC50:  252nM. Assay description: Inhibition of PDE8B expressed in Sf9 insect cells
In DepthDetails ArticlePubMed